Home/Support/Support Forum/Problem to build the basic sample
Welcome to Digi Forum, where you can ask questions and receive answers from other members of the community.

Problem to build the basic sample

0 votes
**** Build of configuration Debug for project Basic Sample ****

make -k -s -j4 all

Building file: ../appconf_api.c
Building Bsp
Invoking: C Compiler
make: /bin/sh: Command not found
make: *** [appconf_api.o] Error 127
Building file: ../root.c
Invoking: C Compiler
make: /bin/sh: Command not found
make: *** [root.o] Error 127
** Copy project files to bsp
make: /bin/sh: Command not found
make: *** [bsp/7_5/connectme9210/lib/libbsp.a] Error 127
make: Target `all' not remade because of errors.

What is the problem?
asked Jul 6, 2016 in NET+OS by haribofan New to the Community (0 points)

Please log in or register to answer this question.

1 Answer

0 votes
>make: /bin/sh: Command not found

this means you have a cygwin problem. Did this work before?
Reinstalling should solve this problem
answered Jul 8, 2016 by LeonidM Veteran of the Digi Community (3,213 points)
...